Deploy OpenBoxes (Grails 3 branch) to obdev4.pih-emr.org

Build: #116 failed Custom build by Evan Waterman with revision 7bf66ad7524a076ca863996af9655e6452740e0f

Logs

The following logs have been generated by the jobs in this plan.
  • Expand all
  • Collapse all
Job Logs
Collapse Default Job Build Download or View
30-Oct-2026 08:21:24 npm ERR! A complete log of this run can be found in:
30-Oct-2026 08:21:24 npm ERR!     /home/bamboo/.npm/_logs/2026-10-30T08_21_24_379Z-debug.log
30-Oct-2026 08:21:24
30-Oct-2026 08:21:24 > Task :npm_run_bundle FAILED
30-Oct-2026 08:21:25
30-Oct-2026 08:21:25 FAILURE: Build failed with an exception.
30-Oct-2026 08:21:25
30-Oct-2026 08:21:25 * What went wrong:
30-Oct-2026 08:21:25 Execution failed for task ':npm_run_bundle'.
30-Oct-2026 08:21:25 > Process 'command '/home/bamboo/remote-agent/xml-data/build-dir/OPENBOXES-OBDEV4-DJ/.gradle/npm/npm-v6.14.18/bin/npm'' finished with non-zero exit value 1
30-Oct-2026 08:21:25
30-Oct-2026 08:21:25 * Try:
30-Oct-2026 08:21:25 Run with --stacktrace option to get the stack trace. Run with --info or --debug option to get more log output. Run with --scan to get full insights.
30-Oct-2026 08:21:25
30-Oct-2026 08:21:25 * Get more help at https://help.gradle.org
30-Oct-2026 08:21:25
30-Oct-2026 08:21:25 BUILD FAILED in 6m 32s
30-Oct-2026 08:21:25 10 actionable tasks: 10 executed
30-Oct-2026 08:21:25 Error |
30-Oct-2026 08:21:25 Command [war] error: Could not execute build using Gradle distribution 'https://services.gradle.org/distributions/gradle-4.10.3-bin.zip'. (Use --stacktrace to see the full trace)
30-Oct-2026 08:21:25 Restarting tomcat ...
30-Oct-2026 08:21:27 Allowing 90 seconds for tomcat to restart ...
30-Oct-2026 08:22:57 Emailing notifications ...
30-Oct-2026 08:22:57 Done.
30-Oct-2026 08:22:57 Unable to publish artifact [Latest WAR]: the source directory /home/bamboo/remote-agent/xml-data/build-dir/OPENBOXES-OBDEV4-DJ/build/libs does not exist.