| 28-Oct-2022 19:29:39 |
def updateAttributes(ProductSupplier productSupplier, Map params) { |
| 28-Oct-2022 19:29:39 |
^ |
| 28-Oct-2022 19:29:48 |
|
| 28-Oct-2022 19:29:48 |
> Task :generateGitProperties |
| 28-Oct-2022 19:29:48 |
> Task :buildProperties FAILED |
| 28-Oct-2022 19:29:48 |
|
| 28-Oct-2022 19:29:48 |
FAILURE: Build failed with an exception. |
| 28-Oct-2022 19:29:48 |
|
| 28-Oct-2022 19:29:48 |
* Where: |
| 28-Oct-2022 19:29:48 |
Build file '/opt/bamboo-home/local-working-dir/OPENBOXES-SDOD2-DJ/build.gradle' line: 714 |
| 28-Oct-2022 19:29:48 |
|
| 28-Oct-2022 19:29:48 |
* What went wrong: |
| 28-Oct-2022 19:29:48 |
Execution failed for task ':buildProperties'. |
| 28-Oct-2022 19:29:48 |
> Cannot get property 'version' on null object |
| 28-Oct-2022 19:29:48 |
|
| 28-Oct-2022 19:29:48 |
* Try: |
| 28-Oct-2022 19:29:48 |
Run with --stacktrace option to get the stack trace. Run with --info or --debug option to get more log output. Run with --scan to get full insights. |
| 28-Oct-2022 19:29:48 |
|
| 28-Oct-2022 19:29:48 |
* Get more help at https://help.gradle.org |
| 28-Oct-2022 19:29:48 |
|
| 28-Oct-2022 19:29:48 |
BUILD FAILED in 1m 34s |
| 28-Oct-2022 19:29:48 |
10 actionable tasks: 10 executed |
| 28-Oct-2022 19:29:48 |
Error | |
| 28-Oct-2022 19:29:48 |
Command [war] error: Could not execute build using Gradle distribution 'https://services.gradle.org/distributions/gradle-4.10.3-bin.zip'. (Use --stacktrace to see the full trace) |
| 28-Oct-2022 19:29:50 |
Unable to publish artifact [Latest WAR]: the source directory /opt/bamboo-home/local-working-dir/OPENBOXES-SDOD2-DJ/build/libs does not exist. |